大学IT网 - 最懂大学生的IT学习网站! QQ资料交流群:367606806
当前位置:大学IT网 > Android技巧 > Android源码编译make的错误处理

Android源码编译make的错误处理

关键词:编译源码Android错误  阅读(730) 赞(13)

[摘要]本文是对Android源码编译make的错误处理的讲解,对学习Android编程技术有所帮助,与大家分享。
android源码下载:官方下载或参考android源码下载方式
Android编译版本: PLATFORM_VERSION=4.0.1(最新Android 4.0.1)
OS 操作系统平台: Linux yanggang 2.6.35-30-generic #61-Ubuntu SMP Tue Oct 11 15:29:15 UTC 2011 i686 GNU/Linux(Ubuntu10.1032bit)

首先,我们先安装一些常用的工具
curl: sudoapt-getinstallcurl
git: sudoapt-getinstallgit
g++: sudoapt-getinstallg++

然后,make遇到缺什么就安装什么

/usr/bin/ld: cannot find -lz
host Executable: aapt (out/host/linux-x86/obj/EXECUTABLES/aapt_intermediates/aapt)
/usr/bin/ld: cannot find -lz
collect2: ld returned 1 exit status
make: *** [out/host/linux-x86/obj/EXECUTABLES/aapt_intermediates/aapt] Error 1
解决方法: sudo apt-get install zlib1g-dev sudo apt-get install lib64z1-dev

/bin/bash: bison: command not found
Yacc: aidl <= frameworks/base/tools/aidl/aidl_language_y.y
bison -d-o out/host/linux-x86/obj/EXECUTABLES/aidl_intermediates/aidl_language_y.cpp frameworks/base/tools/aidl/aidl_language_y.y
/bin/bash: bison: command not found
make: *** [out/host/linux-x86/obj/EXECUTABLES/aidl_intermediates/aidl_language_y.cpp] Error 127
解决方法:sudo apt-get install bison

/bin/bash: flex: command not found
out/host/linux-x86/obj/EXECUTABLES/aidl_intermediates/aidl_language_y.cpp: In function ‘int yyparse()’:
out/host/linux-x86/obj/EXECUTABLES/aidl_intermediates/aidl_language_y.cpp:1827: warning: deprecated conversion from string constant to ‘char*’
out/host/linux-x86/obj/EXECUTABLES/aidl_intermediates/aidl_language_y.cpp:1970: warning: deprecated conversion from string constant to ‘char*’
Lex: aidl <= frameworks/base/tools/aidl/aidl_language_l.l
/bin/bash: flex: command not found
make: *** [out/host/linux-x86/obj/EXECUTABLES/aidl_intermediates/aidl_language_l.cpp] Error 127
解决方法: sudo apt-get install flex

/usr/bin/ld: cannot find -lncurses
host Executable: adb (out/host/linux-x86/obj/EXECUTABLES/adb_intermediates/adb)
/usr/bin/ld: cannot find -lncurses
collect2: ld returned 1 exit status
make: *** [out/host/linux-x86/obj/EXECUTABLES/adb_intermediates/adb] Error 1
解决方法:sudo apt-get install libncurses5-dev

fatal error: GL/glx.h: No such file or directory
development/tools/emulator/opengl/host/libs/Translator/GLcommon/GLDispatch.cpp:22: fatal error: GL/glx.h: No such file or directory
compilation terminated.
make: *** [out/host/linux-x86/obj/STATIC_LIBRARIES/libGLcommon_intermediates/GLDispatch.o] Error 1
解决方法:sudo apt-get install libgl1-mesa-dev

sh: gperf: not found
target Generated: libwebcore <= external/webkit/Source/JavaScriptCore/create_regex_tables
Generating CSSPropertyNames.h <= CSSPropertyNames.in
sh: gperf: not found
calling gperf failed: 32512 at ./makeprop.pl line 140.
make: *** [out/target/product/generic/obj/STATIC_LIBRARIES/libwebcore_intermediates/Source/WebCore/css/CSSPropertyNames.h] Error 25
make: *** Deleting file `out/target/product/generic/obj/STATIC_LIBRARIES/libwebcore_intermediates/Source/WebCore/css/CSSPropertyNames.h'
解决方法:sudo apt-get install gperf


相关评论